{"text_format":"3","workbook":"xlsx","n_sheets":11,"sheets":["Meldung","ANLAGE 1 Betriebsstätten","ANLAGE 2 Unternehmensgruppe","ANLAGE 3 Sortiment Produktion","ANLAGE 4 Sortiment Aufbereitung","ANLAGE 5 Subunternehmer","ANLAGE 5.1 Sub-Erklärung","Datenquelle (nicht bearbeiten)","Datenschutzhinweis Berlin","Datenschutzhinweis Hessen","Datenschutzhinweis Bayern"],"not_rendered":{"defined_names":8},"read":"whole","date_system":"1900"}

{"sheet":"Meldung","index":0,"n_rows":77,"n_cols":19,"rows_kept":77,"merged":[[0,0,0,12],[1,0,1,12],[2,0,2,12],[3,0,7,9],[3,10,3,12],[4,10,7,12],[8,0,8,12],[9,1,9,12],[10,6,10,12],[11,1,14,6],[11,7,11,12],[12,7,12,12],[13,7,13,12],[14,7,14,12],[15,0,15,7],[15,8,15,12],[16,0,16,7],[16,8,16,12],[17,0,17,7],[17,8,17,12],[18,0,18,7],[18,8,18,12],[19,0,19,7],[19,8,19,12],[20,0,20,7],[20,8,20,12],[21,0,21,7],[21,8,21,12],[22,0,22,7],[22,8,22,12],[23,0,23,7],[23,8,23,12],[24,1,24,12],[25,2,25,12],[26,1,26,7],[26,9,26,12],[27,1,27,12],[28,2,28,12],[29,0,29,12],[30,0,30,5],[30,6,30,7],[30,8,30,9],[30,10,30,12],[31,1,31,5],[31,8,31,9],[32,1,32,5],[32,8,32,9],[33,1,33,5],[34,2,34,5],[35,2,35,5],[36,2,36,5],[37,1,37,5],[37,8,37,9],[38,1,38,5],[38,8,39,9],[39,1,39,5],[40,1,40,5],[40,8,40,9],[42,1,43,12],[44,1,44,4],[44,5,44,10],[44,11,44,12],[45,0,45,12],[46,1,50,12],[51,0,51,5],[51,7,51,8],[51,9,52,12],[52,0,52,8],[53,0,53,8],[53,9,53,12],[54,0,54,7],[54,8,54,12],[56,0,56,4],[56,5,56,12],[57,0,62,12],[63,0,63,7],[63,8,63,12],[64,0,64,12],[65,0,65,7],[65,8,65,12],[66,0,66,12],[67,0,67,7],[67,8,67,12],[68,0,68,12],[69,1,69,2],[69,4,69,5],[69,6,69,12],[70,0,70,12],[71,0,71,12],[72,0,72,12],[73,0,73,7],[73,8,73,12],[74,0,74,7],[74,8,74,12],[75,0,75,7],[75,8,75,12],[76,0,76,7],[76,8,76,12]]}
["Meldung gemäß Artikel 34 Absatz 1 der Verordnung (EU) 2018/848 (Öko-VO)"]
["des Europäischen Parlaments und des Rates vom 30.05.2018 über die \nökologische/biologische Produktion und die Kennzeichnung von ökologischen/biologischen \nErzeugnissen sowie zur Aufhebung der VO (EG) Nr. 834/2007 "]
["An die zuständige Behörde (Anzeige Adresse nach Auswahl des Bundeslandes unten)"]
[{"$f":"VLOOKUP($I$20,'Datenquelle (nicht bearbeiten)'!A2:C17,3,FALSE)","v":{"$error":"#N/A"}},{"$nulls":9},"Eingangsdatum Behörde"]
[]
[]
[]
[]
["Bitte gelb markierte Felder ausfüllen (Druckbuchstaben) und das jeweils Zutreffende ankreuzen:"]
[null,"Neumeldung"]
{"$rows_left_out":68}
{"sheet":"ANLAGE 1 Betriebsstätten","index":1,"n_rows":40,"n_cols":6,"rows_kept":40,"merged":[[0,0,0,7],[1,0,1,7],[2,0,2,1],[2,2,2,4],[2,5,2,7],[3,0,3,7],[4,0,4,1],[4,2,4,4],[4,5,4,7],[5,0,5,7],[6,0,6,1],[6,2,6,7],[7,0,7,1],[7,2,7,7],[8,0,8,1],[8,2,8,7],[9,0,9,1],[9,2,9,7],[10,0,10,1],[10,2,10,4],[10,6,10,7],[11,0,11,1],[11,2,11,4],[11,6,11,7],[12,0,12,7],[13,0,13,1],[13,2,13,7],[14,0,14,1],[14,2,14,7],[15,0,15,1],[15,2,15,7],[16,0,16,1],[16,2,16,7],[17,0,17,1],[17,2,17,4],[17,6,17,7],[18,0,18,1],[18,2,18,4],[18,6,18,7],[19,0,19,7],[20,0,20,1],[20,2,20,7],[21,0,21,1],[21,2,21,7],[22,0,22,1],[22,2,22,7],[23,0,23,1],[23,2,23,7],[24,0,24,1],[24,2,24,4],[24,6,24,7],[25,0,25,1],[25,2,25,4],[25,6,25,7],[26,0,26,7],[27,0,27,1],[27,2,27,7],[28,0,28,1],[28,2,28,7],[29,0,29,1],[29,2,29,7],[30,0,30,1],[30,2,30,7],[31,0,31,1],[31,2,31,4],[31,6,31,7],[32,0,32,1],[32,2,32,4],[32,6,32,7],[33,0,33,7],[34,0,34,1],[34,2,34,7],[35,0,35,1],[35,2,35,7],[36,0,36,1],[36,2,36,7],[37,0,37,1],[37,2,37,7],[38,0,38,1],[38,2,38,4],[38,6,38,7],[39,0,39,1],[39,2,39,4],[39,6,39,7]]}
["ANLAGE 1 „Betriebsstätten\" wie Zweigniederlassungen, Verkaufsstellen, Aufbereitungseinrichtungen, Lager"]
[]
["zur Meldung vom   ",null,{"$f":"IF(Meldung!$H$52=0,\"\",Meldung!$H$52)","v":""},null,null,"(Datum) "]
[]
["von Unternehmer/in ",null,{"$f":"IF(Meldung!$I$16=0,\"\",CONCATENATE(Meldung!$I$16,\" \",Meldung!$I$17))","v":""},null,null,"(Name)"]
["Falls Sie mehr Felder benötigen, klicken Sie auf den Namen des Tabellenblatts und duplizieren Sie dieses."]
["Bezeichnung"]
["Straße, Hausnummer"]
["PLZ, Ort"]
["Bundesland"]
{"$rows_left_out":31}
{"sheet":"ANLAGE 2 Unternehmensgruppe","index":2,"n_rows":35,"n_cols":11,"rows_kept":35,"merged":[[0,0,0,2],[0,3,0,5],[1,0,1,9],[2,1,2,2],[2,3,2,6],[3,1,3,2],[3,3,3,6],[4,1,4,2],[4,3,4,6],[5,1,5,2],[5,3,5,6],[6,1,6,2],[6,3,6,6],[7,1,7,2],[7,3,7,6],[8,1,8,2],[8,3,8,6],[9,1,9,2],[9,3,9,6],[10,1,10,2],[10,3,10,6],[11,1,11,2],[11,3,11,6],[12,1,12,2],[12,3,12,6],[13,1,13,2],[13,3,13,6],[14,1,14,2],[14,3,14,6],[15,1,15,2],[15,3,15,6],[16,1,16,2],[16,3,16,6],[17,1,17,2],[17,3,17,6],[18,1,18,2],[18,3,18,6],[19,1,19,2],[19,3,19,6],[20,1,20,2],[20,3,20,6],[21,1,21,2],[21,3,21,6],[22,1,22,2],[22,3,22,6],[23,1,23,2],[23,3,23,6],[24,1,24,2],[24,3,24,6],[25,1,25,2],[25,3,25,6],[26,1,26,2],[26,3,26,6],[27,1,27,2],[27,3,27,6],[28,1,28,2],[28,3,28,6],[29,1,29,2],[29,3,29,6],[30,1,30,2],[30,3,30,6],[31,0,31,9],[32,0,32,3],[32,4,34,9],[33,0,33,3],[34,0,34,3]]}
["ANLAGE 2 „Unternehmergruppe“ ",null,null,{"$f":"IF(Meldung!$I$16=0,\"\",CONCATENATE(Meldung!$I$16,\" \",Meldung!$I$17))","v":""},null,null,"(Bezeichnung)  zur Meldung vom ",null,null,{"$f":"IF(Meldung!$H$52=0,\"\",Meldung!$H$52)","v":""},"(Datum)"]
[]
[null,"Name, Vorname des Mitglieds",null,"Straße und Hausnummer",{"$nulls":3},"PLZ","Bundesland","Ort"]
[1]
[2]
[3]
[4]
[5]
[6]
[7]
{"$rows_left_out":26}
{"sheet":"ANLAGE 3 Sortiment Produktion","index":3,"n_rows":46,"n_cols":9,"rows_kept":46,"merged":[[0,0,0,6],[1,0,1,6],[2,0,2,1],[2,2,2,4],[2,5,2,6],[3,0,3,6],[4,0,4,1],[4,2,4,4],[4,5,4,6],[5,0,5,6],[6,0,6,1],[6,2,6,4],[6,5,6,6],[6,7,6,8],[7,0,17,1],[7,3,7,4],[8,3,8,4],[9,3,9,4],[10,3,10,4],[11,3,11,4],[12,3,12,4],[13,3,13,4],[14,3,14,4],[15,3,15,4],[16,3,16,4],[17,3,17,4],[18,0,31,1],[18,3,18,4],[19,3,19,4],[20,3,20,4],[21,3,21,4],[22,3,22,4],[23,3,23,4],[24,3,24,4],[25,3,25,4],[26,3,26,4],[27,3,27,4],[28,3,28,4],[29,3,29,4],[30,3,30,4],[31,3,31,4],[32,0,38,1],[32,2,38,8],[39,0,43,1],[39,3,39,4],[40,3,40,4],[41,3,41,4],[42,3,42,4],[43,3,43,4],[44,0,44,1],[44,2,44,6],[45,0,45,1],[45,2,45,4],[45,5,45,6],[46,0,46,1],[46,2,46,4],[46,5,46,6],[47,0,47,1],[47,2,47,4],[47,5,47,6],[48,0,48,1],[48,2,48,4],[48,5,48,6],[49,0,49,1],[49,2,49,4],[49,5,49,6],[50,0,50,1],[50,2,50,4],[50,5,50,6],[51,0,51,1],[51,2,51,4],[51,5,51,6],[52,0,52,1],[52,2,52,4],[52,5,52,6],[53,0,53,1],[53,2,53,4],[53,5,53,6],[54,0,54,1],[54,2,54,4],[54,5,54,6]]}
["ANLAGE 3 „Sortiment Produktion“"]
[]
["zur Meldung vom   ",null,{"$f":"IF(Meldung!$H$52=0,\"\",Meldung!$H$52)","v":""},null,null,"(Datum) "]
[]
["von Unternehmer/in ",null,{"$f":"IF(Meldung!$I$16=0,\"\",CONCATENATE(Meldung!$I$16,\" \",Meldung!$I$17))","v":""},null,null,"(Name)"]
[]
["Erzeugniskategorie",null,"ökologisch",null,null,"nicht ökologisch",null,"Produktion während des Umstellungszeitraums"]
["Unverarbeitete Pflanzen und Pflanzenerzeugnisse, einschließlich Pflanzenvermehrungs-material \n\n(Erzeugniskategorie A)",null,null,"Ackerbau",null,null,"Ackerbau",null,"Ackerbau"]
[{"$nulls":3},"Futterbau",null,null,"Futterbau",null,"Futterbau"]
[{"$nulls":3},"Grünland",null,null,"Grünland",null,"Grünland"]
{"$rows_left_out":37}
{"sheet":"ANLAGE 4 Sortiment Aufbereitung","index":4,"n_rows":40,"n_cols":9,"rows_kept":40,"merged":[[0,0,0,6],[1,0,1,6],[2,0,2,1],[2,2,2,4],[2,5,2,6],[3,0,3,6],[4,0,4,1],[4,2,4,4],[4,5,4,6],[5,0,5,6],[6,0,6,1],[6,2,6,4],[6,5,6,6],[6,7,6,8],[7,0,25,1],[7,3,7,4],[8,3,8,4],[9,3,9,4],[10,3,10,4],[11,3,11,4],[12,3,12,4],[13,3,13,4],[14,3,14,4],[15,3,15,4],[16,3,16,4],[17,3,17,4],[18,3,18,4],[19,3,19,4],[20,3,20,4],[21,3,21,4],[22,3,22,4],[23,3,23,4],[24,3,24,4],[25,3,25,4],[26,0,34,1],[26,3,26,4],[27,3,27,4],[28,3,28,4],[29,3,29,4],[30,3,30,4],[31,3,31,4],[32,3,32,4],[33,3,33,4],[34,3,34,4],[35,0,35,1],[35,3,35,4],[36,0,39,1],[36,3,36,4],[37,3,37,4],[38,3,38,4],[39,3,39,4]]}
["ANLAGE 4 „Sortiment Aufbereitung“"]
[]
["zur Meldung vom   ",null,{"$f":"IF(Meldung!$H$52=0,\"\",Meldung!$H$52)","v":""},null,null,"(Datum) "]
[]
["von Unternehmer/in ",null,{"$f":"IF(Meldung!$I$16=0,\"\",CONCATENATE(Meldung!$I$16,\" \",Meldung!$I$17))","v":""},null,null,"(Name)"]
[]
["Erzeugniskategorie",null,"ökologisch",null,null,"nicht ökologisch",null,"Produktion von Umstellungserzeugnissen"]
["Verarbeitete landwirtschaftliche Erzeugnisse, einschließlich Aquakulturerzeugnisse, die zur Verwendung als Lebensmittel bestimmt sind \n\n(Tätigkeitsbereich B)\n(Erzeugniskategorie D)",null,null,"Getreide und -produkte",null,null,"Getreide und -produkte",null,"Getreide und -produkte"]
[{"$nulls":3},"Brot und Backwaren",null,null,"Brot und Backwaren",null,"Brot und Backwaren"]
[{"$nulls":3},"Ölfrüchte und -produkte",null,null,"Ölfrüchte und -produkte",null,"Ölfrüchte und -produkte"]
{"$rows_left_out":31}
{"sheet":"ANLAGE 5 Subunternehmer","index":5,"n_rows":29,"n_cols":19,"rows_kept":29,"merged":[[0,0,0,1],[0,2,0,3],[0,4,0,5],[0,6,0,12],[0,13,0,17],[1,0,1,14],[2,0,4,0],[2,1,4,1],[2,2,4,2],[2,3,4,3],[2,4,4,4],[2,5,4,5],[2,6,4,6],[2,7,4,7],[2,8,2,14],[2,15,2,18],[3,8,4,8],[3,9,4,9],[3,10,4,10],[3,11,4,11],[3,12,4,12],[3,13,4,13],[3,14,4,14],[3,15,3,17],[29,0,29,18]]}
["ANLAGE 5 „Subunternehmer/in“",null," zur Meldung vom ",null,{"$f":"IF(Meldung!$H$52=0,\"\",Meldung!$H$52)","v":""},null,"(Datum) von Unternehmer",{"$nulls":6},{"$f":"IF(Meldung!$I$16=0,\"\",CONCATENATE(Meldung!$I$16,\" \",Meldung!$I$17))","v":""},{"$nulls":4},"(Name) "]
[]
[null,"Name Subunternehmer/in (einschl. Rechtsform)","Straße, Hausnummer","PLZ","Ort","Bundes-land","Land","Sub neu \nseit letzter Meldung","Vergebene Tätigkeit",{"$nulls":6},"Subunternehmer/in"]
[{"$nulls":8},"Produktion (landwirtschaftl.)","Aufbereitung","Vertrieb / Inverkehrbringen","Lagerung","Einfuhr","Ausfuhr","Beschreibung der Tätigkeit","Ohne eigenen Kontrollvertrag (ich übernehme / wir übernehmen gemäß Artikel 34 Abs. 3 der Öko-VO die Verantwortung für die an Subunternehmer/innen ohne eigenen Kontrollvertrag vergebenen Tätigkeiten)",null,null,"Mit eigenem Kontrollvertrag (eigenes Bio-Zertifikat vorhanden)"]
[{"$nulls":15},"Beauftragung Subunternehmer/in ohne eigenen Kontrollvertrag","Schriftliche Zustimmung gemäß ANLAGE 5.1 notwendig ","Schriftliche Zustimmung gemäß ANLAGE 5.1 liegt unterschrieben dieser Meldung bei","Code-Nr. der Kontrollstelle"]
[1,{"$nulls":15},{"$f":"IF(P6=\"Ja\",\"ANLAGE 5.1 nötig\",\"\")","v":""},{"$f":"IF(P6=\"Ja\",\"Mitsenden\",\"\")","v":""}]
[2,{"$nulls":15},{"$f":"IF(P7=\"Ja\",\"ANLAGE 5.1 nötig\",\"\")","v":""},{"$f":"IF(P7=\"Ja\",\"Mitsenden\",\"\")","v":""}]
[3,{"$nulls":15},"",""]
[4,{"$nulls":15},"",""]
[5,{"$nulls":15},"",""]
{"$rows_left_out":20}
{"sheet":"ANLAGE 5.1 Sub-Erklärung","index":6,"n_rows":38,"n_cols":3,"rows_kept":38,"merged":[[0,0,0,2],[3,2,5,2],[9,0,9,2],[13,0,18,2],[20,0,20,2],[21,0,21,2],[22,0,22,2],[23,0,23,2],[24,0,24,2],[25,0,25,2],[26,0,26,2],[27,0,27,2],[28,0,28,2],[29,0,29,2],[31,0,31,2]]}
["Schriftliche Zustimmung bei der Vergabe von Tätigkeiten an Subunternehmer/innen im ökologischen Landbau"]
[]
["zwischen Auftraggeber/in ",null,"und Subunternehmer/in"]
[{"$f":"IF(Meldung!I16=0,\"\",CONCATENATE(Meldung!I16,\" \",Meldung!I17))","v":""}]
[{"$f":"IF(Meldung!I16=0,\"\",Meldung!I18)","v":""}]
[{"$f":"IF(Meldung!I17=0,\"\",Meldung!I19)","v":""}]
[]
["(nachstehend „Auftraggeber“)",null,"(nachstehend „Subunternehmer“)"]
[]
["Der Auftraggeber beauftragt den/die Subunternehmer/in die genannten Tätigkeiten laut Anweisungen und unter Beachtung der für das EU-Öko-Kontrollverfahren geltenden Verordnungen [VO (EU) 2018/848 sowie VO (EU) 2017/625] in der jeweils gültigen Fassung durchzuführen."]
{"$rows_left_out":22}
{"sheet":"Datenquelle (nicht bearbeiten)","index":7,"n_rows":17,"n_cols":7,"rows_kept":17,"hidden":true}
["Bundesland","Bundesland ausgeschrieben","Inhalt","Datenschutzhinweis","Dropdown","Beantwortung","Status"]
["BB","Brandenburg","Ministerium für Landwirtschaft, Umwelt und Klimaschutz (MLUK)\nReferat 33 - Direktzahlungen, Agrarumweltmaßnahmen, ökologischer Landbau\nHenning-von-Tresckow-Straße 2-13\n14467 Potsdam",{"$f":"CONCATENATE(\"Datenschutzhinweis \",B2,\" liegt noch nicht vor\")","v":"Datenschutzhinweis Brandenburg liegt noch nicht vor"},"X","Ja","Nur ökologisch"]
["BE","Berlin","Landesamt für Gesundheit und Soziales (LAGeSo)\nZuständige Behörde für den ökologischen Landbau\n- IV C 4 -\nTurmstraße 21\nHaus A\n10559 Berlin","siehe separates Tabellenblatt \"Datenschutzhinweis Berlin\"",null,"Nein","Ökologisch und Nicht-ökologisch"]
["BW","Baden-Württemberg","Regierungspräsidium Karlsruhe\nAbteilung 3 – Landwirtschaft, Ländlicher Raum, Veterinär- und Lebensmittelwesen\nSachgebiet 33b\n76247 Karlsruhe\n","Informationen zum Schutz personenbezogener Daten, die das Regierungspräsidium Karlsruhe verarbeitet, finden Sie auf unserer Internetseite Datenschutzerklärungen unter [https://rp.baden-wuerttemberg.de/Seiten/Datenschutzerklaerungen.aspx] unter dem Titel „33-27K: Ökologische Produktion (pdf, 138 KB)“. Auf Wunsch werden diese Informationen in Papierform versandt.",null,null,"Ökologisch, In Umstellung und Nicht-ökologisch"]
["BY","Bayern","Landesanstalt für Landwirtschaft (LfL)\nInstitut für Ernährungswirtschaft und Märkte\nArbeitsbereich Vollzug der EG-Öko-Verordnung\nMenzinger Straße 54\n80638 München\n","siehe separates Tabellenblatt \"Datenschutzhinweis Bayern\"",null,null,"Nur Nicht-ökologisch"]
["HB","Bremen","Niedersächsisches Landesamt für Verbraucherschutz und Lebensmittelsicherheit (LAVES)\nDezernat 42 -Ökologischer Landbau-\nPostfach 3949\n26029 Oldenburg",{"$f":"CONCATENATE(\"Datenschutzhinweis \",B6,\" liegt noch nicht vor\")","v":"Datenschutzhinweis Bremen liegt noch nicht vor"}]
["HE","Hessen","Regierungspräsidium Gießen\nAbteilung V\nDezernat 51.2\nSchanzenfeldstraße 8\n35578 Wetzlar","siehe separates Tabellenblatt \"Datenschutzhinweis Hessen\""]
["HH","Hamburg","Freie und Hansestadt Hamburg Behörde für Umwelt, Klima, Energie und Agrarwirtschaft (BUKEA)\nAbt. Agrarwirtschaft Kontrollbehörde ökologischer Landbau und Handelsklassen\nStadthausbrücke 12\n20355 Hamburg","Datenschutzhinweis Hamburg liegt noch nicht vor"]
["MV","Mecklenburg-Vorpommern","Landesamt für Landwirtschaft, Lebensmittelsicherheit und Fischerei (LALLF) Mecklenburg-Vorpommern\nAbteilung für Veterinärdienste und Landwirtschaft\nThierfelderstraße 18\n18059 Rostock\n","Datenschutzhinweis Mecklenburg-Vorpommern liegt noch nicht vor"]
["NI","Niedersachsen","Niedersächsisches Landesamt für Verbraucherschutz und Lebensmittelsicherheit (LAVES)\nDezernat 42 -Ökologischer Landbau-\nPostfach 92 62\n26140 Oldenburg\n","Datenschutzhinweis Niedersachsen liegt noch nicht vor"]
{"$rows_left_out":8}
{"sheet":"Datenschutzhinweis Berlin","index":8,"n_rows":43,"n_cols":1,"rows_kept":43}
["Länderspezifischer Datenschutzhinweis für das Bundesland BERLIN"]
["\nNachfolgend wird zu Ihrer Information dargestellt, welche Daten erhoben, verarbeitet und gespeichert werden. Die Erhebung, Verarbeitung und Speicherung der Daten dient dem Zweck, im Rahmen des ökorechtlichen Kontrollverfahrens mit den betroffenen Unternehmern*innen und zuständigen Institutionen in Verbindung treten zu können. Die erhobenen Daten werden in elektronischer Form im Landesamt für Gesundheit und Soziales sowie in Aktenform gespeichert. Die Erhebung und Verarbeitung der Daten erfolgt auf der Grundlage des § 67a Sozialgesetzbuch Zehntes Buch (SGB X). Die Speicherung beginnt mit dem Eingang der Meldung über die Teilnahme am ökorechtlichen Kontrollverfahren und endet in Anwendung von § 61 GGO 1 10 Jahre nach Betriebseinstellung bzw. nach dem Zeitpunkt, zu dem gemeldete Unternehmer*innen nicht mehr dem Öko-Kontrollverfahren untersteht und keine Rechtsverfahren mehr anhängig sind. Für Vorgänge der sog. Marktkontrolle, bei denen die Kontrollpflicht von Unternehmern*innen überprüft wurde, beginnt die Speicherung mit der Aufnahme von Ermittlungen und endet 5 Jahre nach Abschluss eines Ermittlungsvorgangs. Für die Erhebung, Verarbeitung und Speicherung kommen Daten wie Name, Geschlecht, Titel, ggf. Beruf, ggf. berufliche Qualifikation, private und/oder dienstliche Anschrift und Kontaktdaten sowie Verlauf der Kommunikation in Betracht."]
["Die Datenspeicherung erfolgt aufgrund der Anwendung folgender Rechtsnormen:"]
["•  Gesetz zum Schutz personenbezogener Daten in der Berliner Verwaltung (Bin DSG, § 3 + 15)"]
["•  ÖLG (§§ 2, 81 9, 12, 13 u.a.) mit den dazugehörigen Verordnungen und Gesetzen (ÖkoKennzG, ÖkoKennzV, ÖLGKontrollStZulV)"]
["•  EU-VO [(EG)Nr. 834/2007, Nr. 889/2008 und 1235/12008; (EU)2017/625 und 2020/466 sowie ab dem 01.01.2022 (EU) 2018/848]"]
["Zugriffsberechtigte Personen oder Personengruppen sind alle Mitarbeiter*innen der Fachgruppe LAGeSo IV C 4-Öko-Kontrolle, sowie der zuständige Referatsleiter. Zu den Empfängern, gegenüber denen die Daten offengelegt worden sind oder noch offengelegt werden (einschließlich Empfänger in Drittländern oder internationalen Organisationen) gehören:"]
["Eher regelmäßig:"]
["•  Bundesanstalt für Landwirtschaft und Ernährung (aufgrund ÖLG § 2 Abs. 2)"]
["•  Zuständige Behörden für den ökologischen Landbau in anderen Bundesländern der Bundesrepublik Deutschland (aufgrund ÖLG § 9 Abs. 1)"]
{"$rows_left_out":34}
{"sheet":"Datenschutzhinweis Hessen","index":9,"n_rows":1,"n_cols":1,"rows_kept":1,"merged":[[0,0,1,0]]}
["Länderspezifischer Datenschutzhinweis für das Bundesland  HESSEN\n\nInformationsblatt gemäß Artikel 13 DSGVO\nSie erhalten diese Information nach Artikel 13 DS-GVO, da Sie über Ihre Kontrollstelle dem Regierungspräsidium Gießen im Rahmen eines Verwaltungsverfahrens personenbezogene Daten zu Ihrer Person mitgeteilt haben.\n\nVerantwortlichkeit\nVerantwortlicher der Verarbeitung Ihrer personenbezogenen Daten ist das Regierungspräsidium Gießen. Sie erreichen das Regierungspräsidium Gießen wie folgt: \nLandgraf-Philipp-Str. 1-7, 35390 Gießen; E-Mail: poststelle@rpgi.hessen.de\nTel.: 0641/303-0\n\nUmgang mit Ihren Daten\nDie Berechtigung zur Verwendung und der Umfang der erhobenen Daten ergeben sich aus Art. 6 Abs. 1 Satz 1 lit. c) und lit. e) DSGVO in Verbindung mit Art. 6 Abs. 2 und 3 DSGVO in Verbindung mit der Kontrollverordnung 2017/625 und §§ 3 Abs. 1, 23 HDSIG.\nDie Datenverarbeitung erfolgt zur Erfüllung der gesetzlich übertragenen Aufgaben und ist für die Durchführung der Öko-Kontrolle und die Zertifizierung nach der Verordnung (EU) 2018/848 erforderlich. Die Verarbeitung Ihrer personenbezogenen Daten erfolgt nicht auf Grundlage einer automatisierten Entscheidungsfindung oder Profiling.\n\nEmpfänger\nSoweit dies zur Bearbeitung des Verfahrens erforderlich ist, werden ggf. Ihre personenbezogenen Daten an Dritte übermittelt. Hierzu gehört insbesondere die Weitergabe an beteiligte öffentliche Stellen in Hessen wie z. B. die Lebensmittelüberwachung. Die übermittelten Daten dürfen von den vorgenannten Stellen ausschließlich im Rahmen der gesetzlichen Aufgabenerfüllung verwendet werden.\n\nSpeicherdauer und -fristen\nIhre Daten werden für den Bereich Öko-Kontrolle so lange gespeichert und verarbeitet, wie dies zur Überprüfung der oben genannten Sachverhalte erforderlich ist. Sofern keine spezialgesetzlichen Vorgaben bestehen, erfolgt eine Orientierung an den im Erlass zur Aktenführung in den Dienststellen des Landes Hessen genannten Aufbewahrungsfristen. \n\nIhre Rechte\nEs besteht ein Recht des Betroffenen auf Auskunft seitens des Verantwortlichen über die betreffenden personenbezogenen Daten, auf Berichtigung, Löschung oder auf Einschränkung der Verarbeitung sowie ein Widerspruchsrecht gegen die Verarbeitung. Sie haben darüber hinaus das Recht auf Beschwerde beim Hessischen Beauftragte für Datenschutz und Informationsfreiheit, Postfach 3163, 65021 Wiesbaden. Darüber hinaus können Sie sich mit einer Beschwerde an den/die behördliche Datenschutzbeauftragte wenden, wenn Sie der Auffassung sind, dass datenschutzrechtliche Vorschriften bei der Verarbeitung Ihrer Daten nicht beachtet worden sind.\n\nDatenschutzbeauftragte/r\nDie/den Datenschutzbeauftragte/n des Regierungspräsidiums Gießen erreichen Sie unter der oben genannten Anschrift, zu Hd. der/s Datenschutzbeauftragte/n des Regierungspräsidiums Gießen oder per E-Mail: dsb@rpgi.hessen.de\n"]

{"sheet":"Datenschutzhinweis Bayern","index":10,"n_rows":1,"n_cols":1,"rows_kept":1,"merged":[[0,0,1,0]]}
["Länderspezifischer Datenschutzhinweis für das Bundesland BAYERN\n\nDatenschutzhinweise nach Art. 13 Datenschutzgrundverordnung (DSGVO) \nim Zusammenhang mit der Meldung gemäß Art. 34 Abs. 1 der Verordnung (EU) 2018/848 des Europäischen Parlaments und des Rates vom 30.05.2018 über die ökologische/biologische Produktion und die Kennzeichnung von ökologi-schen/biologischen Erzeugnissen sowie zur Aufhebung der VO (EG) Nr. 834/2007\n\nAllgemeine Hinweise zum Datenschutz finden Sie hier: www.lfl.bayern.de/datenschutz\n\n1. Verarbeitungstätigkeit, Zweck und Rechtsgrundlage der Datenverarbeitung\nDiese Informationen beziehen sich auf die Verarbeitung personenbezogener Daten im Zu-sammenhang mit Meldungen gemäß Art. 34 Abs. 1 der Verordnung (EU) 2018/848 des Euro-päischen Parlaments und des Rates vom 30.05.2018 über die ökologische/biologische Pro-duktion und die Kennzeichnung von ökologischen/biologischen Erzeugnissen sowie zur Auf-hebung der VO (EG) Nr. 834/2007, für die die Bayerische Landesanstalt für Landwirtschaft (LfL) gemäß Art. 4 Land- und forstwirtschaftlichem Zuständigkeits- und Vollzugsgesetz (Zu-VLFG), zuständig ist. Voraussetzung für den sachlichen Anwendungsbereich der Daten-schutzgrundverordnung ist das Vorliegen von personenbezogenen Daten gemäß Art. 4 Nr. 1 DSGVO. \n\nIhre personenbezogenen Daten werden verarbeitet, soweit dies zur Erfüllung der o. g. gesetz-lichen Aufgaben der LfL erforderlich ist. Rechtsgrundlage für die Verarbeitung der Pflichtan-gaben ist Art. 6 Abs. 1 Buchst. c) und e), Abs. 2 und 3 DSGVO i. V. m. Art. 4 Abs. 1 Bayeri-sches Datenschutzgesetz (BayDSG) i. V. m. Art. 34 Abs. 1 VO (EU) 2018/848. Sofern freiwil-lige Angaben getätigt werden, ist Art. 6 Abs. 1 Buchst. a) DSGVO die zugehörige Rechts-grundlage.\n\n2. Empfänger der personenbezogenen Daten\nIhre personenbezogenen Daten werden im Rahmen der gesetzlichen Aufgabenerfüllung an die zuständigen Stellen innerhalb der LfL weitergegeben.\nAn Stellen außerhalb der LfL übermitteln wir Ihre personenbezogenen Daten nur bei Vorliegen Ihrer ausdrücklichen Einwilligung oder im Einzelfall, soweit dies für unsere oder deren Aufga-benerfüllung erforderlich ist, z. B. Bundesministerium für Landwirtschaft und Ernährung, Bay-erisches Staatsministerium für Ernährung, Landwirtschaft und Forsten, Bayerisches Landes-amt für Gesundheit und Lebensmittelsicherheit, Lebensmittelüberwachungsbehörden in Bay-ern, Staatsanwaltschaft bei Verdacht auf Vorliegen einer Straftat, Gerichte. \n\n3. Dauer der Speicherung der personenbezogenen Daten\nIhre Daten werden nach der Erhebung bei der LfL so lange gespeichert, wie dies für die Auf-gabenerfüllung unter Beachtung der gesetzlichen Aufbewahrungsfristen und zur Erfüllung von Dokumentationspflichten notwendig ist. \n\n4. Pflicht zur Bereitstellung der Daten\nSie sind dazu verpflichtet, Ihre Daten anzugeben. Diese Verpflichtung ergibt sich aus Art. 6 Abs. 1 Buchst. c) und Abs. 3 S. 1 Buchst. b) DSGVO i. V. m Art. 34 Abs. 1 VO (EU) 2018/848. Wenn Sie die erforderlichen Daten nicht angeben, kann Ihre Meldung von der zu-ständigen Behörde nicht bearbeitet werden."]